Animal
type: Class
comment: a living organism characterized by voluntary movement.
comment: �tre vivant dou� de sensibilit� de mobilit�. @fr
label: animal

Female
type: Class
comment: an animal that produces gametes (ova) that can be fertilized by male gametes (spermatozoa).
comment: animal appartenant au sexe apte � produire des ovules. @fr
label: female
label: femelle @fr
sub class of: Animal

Lecturer
type: Class
comment: personne qui enseigne une discipline, une technique, un art. @fr
comment: someone who lectures professionally
label: lecturer
label: professeur @fr
sub class of: Person

Male
type: Class
comment: an animal that produces gametes (spermatozoa) that can fertilize female gametes (ova).
comment: individu appartenant au sexe qui poss�de le pouvoir de f�condation. @fr
label: male
label: m�le @fr
sub class of: Animal

Man
type: Class
comment: an adult male person
comment: m�le adulte de l'esp�ce humaine. @fr
label: homme @fr
label: man
sub class of: Male
sub class of: Person

Person
type: Class
comment: a member of the human species
comment: un membre de l'esp�ce humaine. @fr
label: homme @fr
label: humain @fr
label: human
label: human being
label: person
label: personne @fr
label: �tre humain @fr
sub class of: Animal

Researcher
type: Class
comment: a person who devotes himself to doing research
comment: personne adonn�e � des recherches sp�cialis�es. @fr
label: chercheur @fr
label: researcher
label: scientifique @fr
label: scientist
sub class of: Person

Woman
type: Class
comment: an adult female person
comment: femelle adulte de l'esp�ce humaine. @fr
label: femme @fr
label: woman
sub class of: Female
sub class of: Person

age
type: Property
comment: complete existence duration.
comment: dur�e compl�te d'existence. @fr
label: age
label: �ge @fr

hasAncestor
type: Property
comment: relation between an animal and another animal from which it is descended.
comment: relation entre un animal et un autre animal duquel il descend. @fr
domain: Animal
label: a pour anc�tre @fr
label: has for ancestor
range: Animal

hasBrother
type: Property
comment: relation avec un m�le ayant les m�mes parents. @fr
comment: relation with a male who has the same parents.
domain: Animal
label: a pour fr�re @fr
label: has for brother
range: Male

hasChild
type: Property
comment: relation between an animal and another animal to which it gave birth.
comment: relation entre un animal et un autre animal auquel il a donn� naissance. @fr
label: a pour enfant @fr
label: has for child

hasFather
type: Property
comment: avoir pour parent un m�le. @fr
comment: to have for parent a male.
label: a pour p�re @fr
label: has for father
range: Male
sub property of: hasParent

hasFriend
type: Property
comment: relation between a person and another person he or she knows well and regards with affection and trust.
comment: relation entre une personne et une autre personne qui est l'objet d'un attachement privil�gi�. @fr
domain: Person
label: a pour ami @fr
label: has for friend
range: Person

hasMother
type: Property
comment: avoir pour parent un femmelle. @fr
comment: to have for parent a female.
label: a pour m�re @fr
label: has for mother
range: Female
sub property of: hasParent

hasParent
type: Property
comment: relation between an animal and another animal which gave birth to it.
comment: relation entre un animal et un autre animal qui lui a donn� naissance. @fr
label: a pour parent @fr
label: has for parent
sub property of: hasAncestor

hasSister
type: Property
comment: relation avec une femelle ayant les m�mes parents. @fr
comment: relation with a female who has the same parents.
domain: Animal
label: a pour soeur @fr
label: has for sister
range: Female

hasSpouse
type: Property
comment: a person's partner in marriage.
comment: le partenaire d'une personne dans un mariage. @fr
domain: Person
label: est en m�nage avec @fr
label: has for spouse
range: Person

name
type: Property
comment: designation of something.
comment: d�signation de quelque chose. @fr
label: name
label: nom @fr

shirtsize
type: Property
comment: dimensions approximatives des chemises port�es par une personne. @fr
comment: express in some way the approximate dimensions of the shirts of a person.
domain: Person
label: shirt size
label: size
label: taille @fr
label: taille de chemise @fr

shoesize
type: Property
comment: express in some way the approximate length of the shoes for a person.
comment: taille, exprim�e en points, des chaussures d'une personne. @fr
domain: Person
label: pointure @fr
label: shoe size
label: size

trouserssize
type: Property
comment: dimensions approximatives des pantalons port�s par une personne. @fr
comment: express in some way the approximate dimensions of the trousers of a person.
domain: Person
label: size
label: taille @fr
label: taille de pantalon @fr
label: trousers size